{"text_format":"1","workbook":"xlsx","n_sheets":7,"sheets":["Menu","Colab","Calculos","Projeção","Dash1","Instruções","Calc"],"not_rendered":{"charts":3,"images":8,"macros":1,"external_links":0,"defined_names":9,"comments":0,"pivot_tables":0},"unopened":[],"bounds":{"document_bytes":16777216,"sheet_cells":100000,"rows_first":2000,"rows_last":500,"rows_between":2000,"halvings":0,"cell_chars":16384,"cell_head_chars":4096},"cells_cut":0,"cells_raw":0,"read":"whole","date_system":"1900"}

{"sheet":"Menu","index":0,"n_rows":26,"n_cols":7,"rows_kept":26,"cut":false,"hidden":false,"merged":[[25,4,25,5],[25,6,25,14]]}
[]
[]
[]
[]
[]
[]
[]
[]
[]
[]
[]
[]
[]
[]
[]
[]
[]
[]
[]
[]
{"$rows_left_out":7}
{"sheet":"Colab","index":1,"n_rows":63,"n_cols":11,"rows_kept":63,"cut":false,"hidden":false,"merged":[[9,2,9,3],[11,1,11,8],[12,6,12,7]]}
[]
[]
[]
[]
[]
[]
[]
[]
[]
[null,"Empresa:",{"$f":"Menu!G26","v":"Empresa ABCDE"}]
[]
[null,"CADASTRO DE COLABORADORES\nInsira os dados dos seus colaboradores."]
[null,"Colaborador","Área","Cargo","Data Admissão","Salário Base","Período Aquisitivo",null,"Limite de Gozo","Data Retirada Férias","Status"]
[null,"José da Silva","Administrativo","Assistente Administrativo",null,2000,"2020-01-01","2019-05-31",{"$f":"IF(H14=\"\",\"\",H14+336)","v":"2020-05-01"},null,{"$f":"IF(B14=\"\",\"\",IF(AND(J14=\"\",I14<TODAY()),\"Férias Vencida\",IF(J14=\"\",\"Férias a Vencer\",IF(J14<>\"\",\"Férias Retirada\",\"\"))))","v":"Férias Vencida"}]
[null,"João Alves","Produção","Auxiliar de PCP",null,1200,"2019-10-15","2020-10-14",{"$f":"IF(H15=\"\",\"\",H15+336)","v":"2021-09-15"},"2020-10-14",{"$f":"IF(B15=\"\",\"\",IF(AND(J15=\"\",I15<TODAY()),\"Férias Vencida\",IF(J15=\"\",\"Férias a Vencer\",IF(J15<>\"\",\"Férias Retirada\",\"\"))))","v":"Férias Retirada"}]
[null,"Paulo Vitor","Almoxarifado","Almoxarife",null,1500,"2019-05-10","2020-05-09","2021-04-10",null,"Férias Vencida"]
[null,null,null,null,null,null,null,null,"",null,""]
[null,null,null,null,null,null,null,null,"",null,""]
[null,null,null,null,null,null,null,null,"",null,""]
[null,null,null,null,null,null,null,null,"",null,""]
{"$rows_left_out":44}
{"sheet":"Calculos","index":2,"n_rows":63,"n_cols":17,"rows_kept":63,"cut":false,"hidden":false,"merged":[[9,3,9,13],[11,1,11,13]]}
[]
[]
[]
[]
[]
[]
[]
[]
[]
[null,"Empresa:",null,{"$f":"Menu!G26","v":"Empresa ABCDE"}]
[]
[null,"CÁLCULOS DOS DESEMBOLSOS\nNessa tela é possível visualizar os desembolsos de cada funcionário."]
[null,"Colaborador","Dias Férias","Salário Base","Valor Médio Horas Extras","Remuneração Variável","1/3 Férias","INSS","IR","Outras Deduções","Dias Vendidos","Abono Pecuniário","Adiantar 13º nas Férias","Total Líquido",null,null,"Média"]
[null,"José da Silva",10,{"$f":"IFERROR(VLOOKUP(B14,Colab!$B$14:$F$63,5,0)*C14/30,\"\")","v":666.66666666666663},null,null,{"$f":"IFERROR((D14+E14+F14)/3,\"\")","v":222.2222222222222},{"$f":"IFERROR((D14+E14+F14+G14)*VLOOKUP((D14+E14+F14+G14),Calc!$A$2:$B$5,2,1),0)","v":0},{"$f":"IFERROR((D14+E14+F14+G14-H14-J14)*VLOOKUP((D14+E14+F14+G14-H14-J14),Calc!$D$2:$F$6,2,1)-VLOOKUP((D14+E14+F14+G14-H14-J14),Calc!$D$2:$F$6,3,1),0)","v":0},null,10,{"$f":"IFERROR(((VLOOKUP(B14,Colab!$B$14:$F$63,5,0)+E14+F14)/30)*K14,\"\")","v":666.66666666666674},null,{"$f":"IFERROR(D14+E14+F14+G14-H14-I14-J14+L14+M14,\"\")","v":1555.5555555555557},null,null,{"$f":"IFERROR(AVERAGEIF(D14:N14,\">0\"),\"\")","v":624.22222222222229}]
[null,"José da Silva",10,{"$f":"IFERROR(VLOOKUP(B15,Colab!$B$14:$F$63,5,0)*C15/30,\"\")","v":666.66666666666663},null,null,{"$f":"IFERROR((D15+E15+F15)/3,\"\")","v":222.2222222222222},{"$f":"IFERROR((D15+E15+F15+G15)*VLOOKUP((D15+E15+F15+G15),Calc!$A$2:$B$5,2,1),0)","v":0},{"$f":"IFERROR((D15+E15+F15+G15-H15-J15)*VLOOKUP((D15+E15+F15+G15-H15-J15),Calc!$D$2:$F$6,2,1)-VLOOKUP((D15+E15+F15+G15-H15-J15),Calc!$D$2:$F$6,3,1),0)","v":0},null,null,{"$f":"IFERROR(((VLOOKUP(B15,Colab!$B$14:$F$63,5,0)+E15+F15)/30)*K15,\"\")","v":0},null,{"$f":"IFERROR(D15+E15+F15+G15-H15-I15-J15+L15+M15,\"\")","v":888.8888888888888},null,null,592.5925925925925]
[null,null,null,{"$f":"IFERROR(VLOOKUP(B16,Colab!$B$14:$F$63,5,0)*C16/30,\"\")","v":""},null,null,"",{"$f":"IFERROR((D16+E16+F16+G16)*VLOOKUP((D16+E16+F16+G16),Calc!$A$2:$B$5,2,1),0)","v":0},{"$f":"IFERROR((D16+E16+F16+G16-H16-J16)*VLOOKUP((D16+E16+F16+G16-H16-J16),Calc!$D$2:$F$6,2,1)-VLOOKUP((D16+E16+F16+G16-H16-J16),Calc!$D$2:$F$6,3,1),0)","v":0},null,null,{"$f":"IFERROR(((VLOOKUP(B16,Colab!$B$14:$F$63,5,0)+E16+F16)/30)*K16,\"\")","v":""},null,"",null,null,""]
[null,null,null,{"$f":"IFERROR(VLOOKUP(B17,Colab!$B$14:$F$63,5,0)*C17/30,\"\")","v":""},null,null,"",{"$f":"IFERROR((D17+E17+F17+G17)*VLOOKUP((D17+E17+F17+G17),Calc!$A$2:$B$5,2,1),0)","v":0},{"$f":"IFERROR((D17+E17+F17+G17-H17-J17)*VLOOKUP((D17+E17+F17+G17-H17-J17),Calc!$D$2:$F$6,2,1)-VLOOKUP((D17+E17+F17+G17-H17-J17),Calc!$D$2:$F$6,3,1),0)","v":0},null,null,{"$f":"IFERROR(((VLOOKUP(B17,Colab!$B$14:$F$63,5,0)+E17+F17)/30)*K17,\"\")","v":""},null,"",null,null,""]
[null,null,null,{"$f":"IFERROR(VLOOKUP(B18,Colab!$B$14:$F$63,5,0)*C18/30,\"\")","v":""},null,null,"",{"$f":"IFERROR((D18+E18+F18+G18)*VLOOKUP((D18+E18+F18+G18),Calc!$A$2:$B$5,2,1),0)","v":0},{"$f":"IFERROR((D18+E18+F18+G18-H18-J18)*VLOOKUP((D18+E18+F18+G18-H18-J18),Calc!$D$2:$F$6,2,1)-VLOOKUP((D18+E18+F18+G18-H18-J18),Calc!$D$2:$F$6,3,1),0)","v":0},null,null,{"$f":"IFERROR(((VLOOKUP(B18,Colab!$B$14:$F$63,5,0)+E18+F18)/30)*K18,\"\")","v":""},null,"",null,null,""]
[null,null,null,{"$f":"IFERROR(VLOOKUP(B19,Colab!$B$14:$F$63,5,0)*C19/30,\"\")","v":""},null,null,"",{"$f":"IFERROR((D19+E19+F19+G19)*VLOOKUP((D19+E19+F19+G19),Calc!$A$2:$B$5,2,1),0)","v":0},{"$f":"IFERROR((D19+E19+F19+G19-H19-J19)*VLOOKUP((D19+E19+F19+G19-H19-J19),Calc!$D$2:$F$6,2,1)-VLOOKUP((D19+E19+F19+G19-H19-J19),Calc!$D$2:$F$6,3,1),0)","v":0},null,null,{"$f":"IFERROR(((VLOOKUP(B19,Colab!$B$14:$F$63,5,0)+E19+F19)/30)*K19,\"\")","v":""},null,"",null,null,""]
[null,null,null,{"$f":"IFERROR(VLOOKUP(B20,Colab!$B$14:$F$63,5,0)*C20/30,\"\")","v":""},null,null,"",{"$f":"IFERROR((D20+E20+F20+G20)*VLOOKUP((D20+E20+F20+G20),Calc!$A$2:$B$5,2,1),0)","v":0},{"$f":"IFERROR((D20+E20+F20+G20-H20-J20)*VLOOKUP((D20+E20+F20+G20-H20-J20),Calc!$D$2:$F$6,2,1)-VLOOKUP((D20+E20+F20+G20-H20-J20),Calc!$D$2:$F$6,3,1),0)","v":0},null,null,{"$f":"IFERROR(((VLOOKUP(B20,Colab!$B$14:$F$63,5,0)+E20+F20)/30)*K20,\"\")","v":""},null,"",null,null,""]
{"$rows_left_out":44}
{"sheet":"Projeção","index":3,"n_rows":65,"n_cols":26,"rows_kept":65,"cut":false,"hidden":false,"merged":[[9,2,9,6],[11,1,11,12]]}
[]
[]
[]
[]
[]
[]
[]
[]
[]
[null,"Empresa:",{"$f":"Menu!G26","v":"Empresa ABCDE"}]
[]
[null,"PROJEÇÃO DE FÉRIAS\nInsira programação de férias de seus colaboradores para visualizar a projeção financeira na tela de Relatórios."]
[null,"Janeiro","Fevereiro","Março","Abril","Maio","Junho","Julho","Agosto","Setembro","Outubro","Novembro","Dezembro",null,"Janeiro","Fevereiro","Março","Abril","Maio","Junho","Julho","Agosto","Setembro","Outubro","Novembro","Dezembro"]
[null,"José da Silva",null,null,null,null,"João Alves",null,null,null,{"$f":"IFERROR(AVERAGEIF(C14:H14,\">0\"),\"\")","v":""},null,null,null,{"$f":"SUMIF(Calculos!$B$14:$B$63,Projeção!B14,Calculos!$N$14:$N$63)","v":2444.4444444444443},{"$f":"SUMIF(Calculos!$B$14:$B$63,Projeção!C14,Calculos!$N$14:$N$63)","v":0},{"$f":"SUMIF(Calculos!$B$14:$B$63,Projeção!D14,Calculos!$N$14:$N$63)","v":0},{"$f":"SUMIF(Calculos!$B$14:$B$63,Projeção!E14,Calculos!$N$14:$N$63)","v":0},{"$f":"SUMIF(Calculos!$B$14:$B$63,Projeção!F14,Calculos!$N$14:$N$63)","v":0},{"$f":"SUMIF(Calculos!$B$14:$B$63,Projeção!G14,Calculos!$N$14:$N$63)","v":0},{"$f":"SUMIF(Calculos!$B$14:$B$63,Projeção!H14,Calculos!$N$14:$N$63)","v":0},{"$f":"SUMIF(Calculos!$B$14:$B$63,Projeção!I14,Calculos!$N$14:$N$63)","v":0},{"$f":"SUMIF(Calculos!$B$14:$B$63,Projeção!J14,Calculos!$N$14:$N$63)","v":0},{"$f":"SUMIF(Calculos!$B$14:$B$63,Projeção!K14,Calculos!$N$14:$N$63)","v":0},{"$f":"SUMIF(Calculos!$B$14:$B$63,Projeção!L14,Calculos!$N$14:$N$63)","v":0},{"$f":"SUMIF(Calculos!$B$14:$B$63,Projeção!M14,Calculos!$N$14:$N$63)","v":0}]
[null,"Paulo Vitor",null,null,null,null,"Paulo Vitor",null,null,null,{"$f":"IFERROR(AVERAGEIF(C15:H15,\">0\"),\"\")","v":""},null,null,null,{"$f":"SUMIF(Calculos!$B$14:$B$63,Projeção!B15,Calculos!$N$14:$N$63)","v":0},{"$f":"SUMIF(Calculos!$B$14:$B$63,Projeção!C15,Calculos!$N$14:$N$63)","v":0},{"$f":"SUMIF(Calculos!$B$14:$B$63,Projeção!D15,Calculos!$N$14:$N$63)","v":0},{"$f":"SUMIF(Calculos!$B$14:$B$63,Projeção!E15,Calculos!$N$14:$N$63)","v":0},{"$f":"SUMIF(Calculos!$B$14:$B$63,Projeção!F15,Calculos!$N$14:$N$63)","v":0},{"$f":"SUMIF(Calculos!$B$14:$B$63,Projeção!G15,Calculos!$N$14:$N$63)","v":0},{"$f":"SUMIF(Calculos!$B$14:$B$63,Projeção!H15,Calculos!$N$14:$N$63)","v":0},{"$f":"SUMIF(Calculos!$B$14:$B$63,Projeção!I15,Calculos!$N$14:$N$63)","v":0},{"$f":"SUMIF(Calculos!$B$14:$B$63,Projeção!J15,Calculos!$N$14:$N$63)","v":0},{"$f":"SUMIF(Calculos!$B$14:$B$63,Projeção!K15,Calculos!$N$14:$N$63)","v":0},{"$f":"SUMIF(Calculos!$B$14:$B$63,Projeção!L15,Calculos!$N$14:$N$63)","v":0},{"$f":"SUMIF(Calculos!$B$14:$B$63,Projeção!M15,Calculos!$N$14:$N$63)","v":0}]
[null,null,null,null,null,null,null,null,null,null,"",null,null,null,{"$f":"SUMIF(Calculos!$B$14:$B$63,Projeção!B16,Calculos!$N$14:$N$63)","v":0},{"$f":"SUMIF(Calculos!$B$14:$B$63,Projeção!C16,Calculos!$N$14:$N$63)","v":0},{"$f":"SUMIF(Calculos!$B$14:$B$63,Projeção!D16,Calculos!$N$14:$N$63)","v":0},{"$f":"SUMIF(Calculos!$B$14:$B$63,Projeção!E16,Calculos!$N$14:$N$63)","v":0},{"$f":"SUMIF(Calculos!$B$14:$B$63,Projeção!F16,Calculos!$N$14:$N$63)","v":0},{"$f":"SUMIF(Calculos!$B$14:$B$63,Projeção!G16,Calculos!$N$14:$N$63)","v":0},{"$f":"SUMIF(Calculos!$B$14:$B$63,Projeção!H16,Calculos!$N$14:$N$63)","v":0},{"$f":"SUMIF(Calculos!$B$14:$B$63,Projeção!I16,Calculos!$N$14:$N$63)","v":0},{"$f":"SUMIF(Calculos!$B$14:$B$63,Projeção!J16,Calculos!$N$14:$N$63)","v":0},{"$f":"SUMIF(Calculos!$B$14:$B$63,Projeção!K16,Calculos!$N$14:$N$63)","v":0},{"$f":"SUMIF(Calculos!$B$14:$B$63,Projeção!L16,Calculos!$N$14:$N$63)","v":0},{"$f":"SUMIF(Calculos!$B$14:$B$63,Projeção!M16,Calculos!$N$14:$N$63)","v":0}]
[null,null,null,null,null,null,null,null,null,null,"",null,null,null,{"$f":"SUMIF(Calculos!$B$14:$B$63,Projeção!B17,Calculos!$N$14:$N$63)","v":0},{"$f":"SUMIF(Calculos!$B$14:$B$63,Projeção!C17,Calculos!$N$14:$N$63)","v":0},{"$f":"SUMIF(Calculos!$B$14:$B$63,Projeção!D17,Calculos!$N$14:$N$63)","v":0},{"$f":"SUMIF(Calculos!$B$14:$B$63,Projeção!E17,Calculos!$N$14:$N$63)","v":0},{"$f":"SUMIF(Calculos!$B$14:$B$63,Projeção!F17,Calculos!$N$14:$N$63)","v":0},{"$f":"SUMIF(Calculos!$B$14:$B$63,Projeção!G17,Calculos!$N$14:$N$63)","v":0},{"$f":"SUMIF(Calculos!$B$14:$B$63,Projeção!H17,Calculos!$N$14:$N$63)","v":0},{"$f":"SUMIF(Calculos!$B$14:$B$63,Projeção!I17,Calculos!$N$14:$N$63)","v":0},{"$f":"SUMIF(Calculos!$B$14:$B$63,Projeção!J17,Calculos!$N$14:$N$63)","v":0},{"$f":"SUMIF(Calculos!$B$14:$B$63,Projeção!K17,Calculos!$N$14:$N$63)","v":0},{"$f":"SUMIF(Calculos!$B$14:$B$63,Projeção!L17,Calculos!$N$14:$N$63)","v":0},{"$f":"SUMIF(Calculos!$B$14:$B$63,Projeção!M17,Calculos!$N$14:$N$63)","v":0}]
[null,null,null,null,null,null,null,null,null,null,"",null,null,null,{"$f":"SUMIF(Calculos!$B$14:$B$63,Projeção!B18,Calculos!$N$14:$N$63)","v":0},{"$f":"SUMIF(Calculos!$B$14:$B$63,Projeção!C18,Calculos!$N$14:$N$63)","v":0},{"$f":"SUMIF(Calculos!$B$14:$B$63,Projeção!D18,Calculos!$N$14:$N$63)","v":0},{"$f":"SUMIF(Calculos!$B$14:$B$63,Projeção!E18,Calculos!$N$14:$N$63)","v":0},{"$f":"SUMIF(Calculos!$B$14:$B$63,Projeção!F18,Calculos!$N$14:$N$63)","v":0},{"$f":"SUMIF(Calculos!$B$14:$B$63,Projeção!G18,Calculos!$N$14:$N$63)","v":0},{"$f":"SUMIF(Calculos!$B$14:$B$63,Projeção!H18,Calculos!$N$14:$N$63)","v":0},{"$f":"SUMIF(Calculos!$B$14:$B$63,Projeção!I18,Calculos!$N$14:$N$63)","v":0},{"$f":"SUMIF(Calculos!$B$14:$B$63,Projeção!J18,Calculos!$N$14:$N$63)","v":0},{"$f":"SUMIF(Calculos!$B$14:$B$63,Projeção!K18,Calculos!$N$14:$N$63)","v":0},{"$f":"SUMIF(Calculos!$B$14:$B$63,Projeção!L18,Calculos!$N$14:$N$63)","v":0},{"$f":"SUMIF(Calculos!$B$14:$B$63,Projeção!M18,Calculos!$N$14:$N$63)","v":0}]
[null,null,null,null,null,null,null,null,null,null,"",null,null,null,{"$f":"SUMIF(Calculos!$B$14:$B$63,Projeção!B19,Calculos!$N$14:$N$63)","v":0},{"$f":"SUMIF(Calculos!$B$14:$B$63,Projeção!C19,Calculos!$N$14:$N$63)","v":0},{"$f":"SUMIF(Calculos!$B$14:$B$63,Projeção!D19,Calculos!$N$14:$N$63)","v":0},{"$f":"SUMIF(Calculos!$B$14:$B$63,Projeção!E19,Calculos!$N$14:$N$63)","v":0},{"$f":"SUMIF(Calculos!$B$14:$B$63,Projeção!F19,Calculos!$N$14:$N$63)","v":0},{"$f":"SUMIF(Calculos!$B$14:$B$63,Projeção!G19,Calculos!$N$14:$N$63)","v":0},{"$f":"SUMIF(Calculos!$B$14:$B$63,Projeção!H19,Calculos!$N$14:$N$63)","v":0},{"$f":"SUMIF(Calculos!$B$14:$B$63,Projeção!I19,Calculos!$N$14:$N$63)","v":0},{"$f":"SUMIF(Calculos!$B$14:$B$63,Projeção!J19,Calculos!$N$14:$N$63)","v":0},{"$f":"SUMIF(Calculos!$B$14:$B$63,Projeção!K19,Calculos!$N$14:$N$63)","v":0},{"$f":"SUMIF(Calculos!$B$14:$B$63,Projeção!L19,Calculos!$N$14:$N$63)","v":0},{"$f":"SUMIF(Calculos!$B$14:$B$63,Projeção!M19,Calculos!$N$14:$N$63)","v":0}]
[null,null,null,null,null,null,null,null,null,null,"",null,null,null,{"$f":"SUMIF(Calculos!$B$14:$B$63,Projeção!B20,Calculos!$N$14:$N$63)","v":0},{"$f":"SUMIF(Calculos!$B$14:$B$63,Projeção!C20,Calculos!$N$14:$N$63)","v":0},{"$f":"SUMIF(Calculos!$B$14:$B$63,Projeção!D20,Calculos!$N$14:$N$63)","v":0},{"$f":"SUMIF(Calculos!$B$14:$B$63,Projeção!E20,Calculos!$N$14:$N$63)","v":0},{"$f":"SUMIF(Calculos!$B$14:$B$63,Projeção!F20,Calculos!$N$14:$N$63)","v":0},{"$f":"SUMIF(Calculos!$B$14:$B$63,Projeção!G20,Calculos!$N$14:$N$63)","v":0},{"$f":"SUMIF(Calculos!$B$14:$B$63,Projeção!H20,Calculos!$N$14:$N$63)","v":0},{"$f":"SUMIF(Calculos!$B$14:$B$63,Projeção!I20,Calculos!$N$14:$N$63)","v":0},{"$f":"SUMIF(Calculos!$B$14:$B$63,Projeção!J20,Calculos!$N$14:$N$63)","v":0},{"$f":"SUMIF(Calculos!$B$14:$B$63,Projeção!K20,Calculos!$N$14:$N$63)","v":0},{"$f":"SUMIF(Calculos!$B$14:$B$63,Projeção!L20,Calculos!$N$14:$N$63)","v":0},{"$f":"SUMIF(Calculos!$B$14:$B$63,Projeção!M20,Calculos!$N$14:$N$63)","v":0}]
{"$rows_left_out":46}
{"sheet":"Dash1","index":4,"n_rows":11,"n_cols":4,"rows_kept":11,"cut":false,"hidden":false,"merged":[[14,17,17,20],[10,1,10,2],[10,3,10,20]]}
[]
[]
[]
[]
[]
[]
[]
[]
[]
[]
[null,"Empresa:",null,{"$f":"Menu!G26","v":"Empresa ABCDE"}]

{"sheet":"Instruções","index":5,"n_rows":0,"n_cols":0,"rows_kept":0,"cut":false,"hidden":false,"merged":[]}

{"sheet":"Calc","index":6,"n_rows":11,"n_cols":6,"rows_kept":11,"cut":false,"hidden":false,"merged":[]}
["Salário","% INSS",null,"Salário","% IR","Dedução"]
[1045,7.4999999999999997E-2,null,0,0,0]
[2089.6,0.09,null,1903.98,7.4999999999999997E-2,142.80000000000001]
[3134.4,0.12,null,2826.65,0.15,354.8]
[6101.06,0.14000000000000001,null,3751.05,0.22500000000000001,636.13]
[null,null,null,4664.68,0.27500000000000002,869.36]
[]
[]
["Férias Vencida",{"$f":"COUNTIF(Colab!$K$14:$K$63,Calc!A9)","v":2}]
["Férias Retirada",{"$f":"COUNTIF(Colab!$K$14:$K$63,Calc!A10)","v":1}]
["Férias a Vencer",{"$f":"COUNTIF(Colab!$K$14:$K$63,Calc!A11)","v":0}]